##TITLE= Ethyl 3-Chloropyrazine-2-carboxylate (neat)
##JCAMP-DX= 4.24 
##DATA TYPE= INFRARED SPECTRUM
##$ASDF FORM= DIFDUP
##ORIGIN= IRview 1.4c
##OWNER= N. Haider, University of Vienna
##DATE= 02/05/08
##TIME= 11:47:41.00
##SPECTROMETER/DATA SYSTEM= PERKIN-ELMER Spectrum 1000
##INSTRUMENT PARAMETERS= 16 scans
##DATA PROCESSING= 
##XUNITS= 1/CM
##YUNITS= TRANSMITTANCE
##XFACTOR= 1.0
##YFACTOR= 0.00001
##FIRSTX= 4400.0
##LASTX= 450.0
##NPOINTS= 3951
##FIRSTY= 82.21755
##MAXY= 92.20626
##MINY= 17.70458
##XYDATA= (X++(Y..Y))
4400.0H2218K4J4J9L0K4j4j5K4J8pQJ1JmPJ0%kj5
4381.0H2351oOkk5j7%RNj6l0l1k%k7j5kl1j5p
4362.0H2145kl9l1jkm7k4Ok8k9j5lk3k2%j0j9p%
4343.0H1849j6J1L0J6RLJ7M8L1J0L3M7J7N5N4J7M0TL4
4324.0H2345K4M6M5K6%J0M8L8QoOK4LJ5J2j5j9oJ2
4305.0H2616kk0j9k2J3on0k3Orj8j7j9qkJk5j4K
4286.0H2384J4NqTJ1K9Kj4J1RQL6NQJkJ2L0n
4267.0H2528j0K9J4jJ0K0RnRKJL3K6J5K5J3MK6N3
$$ plain form
4400.0 82218 82242 82256 82275 82305 82329 82315 82300 82324 82342 82335 82343 82354 82355 82351 82358 82368 82368 82366 82351
4381.0 82351 82345 82351 82349 82324 82307 82307 82316 82321 82305 82275 82244 82242 82242 82215 82200 82198 82167 82152 82145
4362.0 82145 82143 82104 82073 82072 82070 82023 81999 82005 81977 81948 81933 81930 81907 81885 81885 81875 81856 81849 81849
4343.0 81849 81833 81844 81874 81890 81899 81902 81919 81967 81998 82008 82041 82088 82105 82160 82214 82231 82271 82311 82345
4324.0 82345 82369 82415 82460 82486 82486 82496 82544 82582 82590 82584 82590 82614 82617 82632 82644 82629 82610 82604 82616
4305.0 82616 82614 82594 82575 82553 82566 82560 82510 82487 82493 82484 82466 82449 82430 82422 82420 82421 82396 82382 82384
4286.0 82384 82398 82403 82395 82387 82398 82427 82429 82415 82426 82435 82443 82479 82484 82492 82493 82491 82503 82533 82528
4267.0 82528 82518 82547 82561 82560 82570 82590 82599 82594 82603 82605 82606 82639 82665 82680 82705 82718 82722 82748 82801
4248.0H2801L1MJ6L4L6L5K5K3J5J3K3TN6J0j7J2L9J3K3
4229.0H3215J6Pj2K2K3OLPpJ2J3j3oK6K1qj8J3K3
4210.0H3343J9kk2Nj4k3K8L2kj9kJ4Qj7j5nk4LJ
4191.0H3308j2rj8j3Jpj1k7Lk7j3j4j5kJpkj1k4
4172.0H3101qnMJ4kj9jO%Tkok2Oj1TKmJ0
4153.0H3052J0j4jMK1L8Jj2MJ6PMkJ9K8K0QmQ
4134.0H3207oJ2J8NOPJ5K2rjj0kLj1J4kpPo
4115.0H3262pk8MJ4j3k5j1j0njqNkmrlK0J1j
$$ plain form
4248.0 82801 82832 82836 82852 82886 82922 82957 82982 83005 83020 83033 83056 83079 83135 83145 83128 83140 83179 83192 83215
4229.0 83215 83231 83238 83226 83248 83271 83277 83280 83287 83280 83292 83305 83292 83286 83312 83333 83325 83307 83320 83343
4210.0 83343 83362 83360 83338 83343 83329 83306 83334 83366 83364 83345 83343 83357 83365 83348 83333 83328 83304 83307 83308
4191.0 83308 83296 83287 83269 83256 83257 83250 83239 83212 83215 83188 83175 83161 83146 83144 83145 83138 83136 83125 83101
4172.0 83101 83093 83088 83092 83106 83104 83085 83084 83090 83090 83090 83088 83082 83060 83066 83055 83044 83046 83042 83052
4153.0 83052 83062 83048 83047 83051 83072 83110 83111 83099 83103 83119 83126 83130 83128 83147 83175 83195 83203 83199 83207
4134.0 83207 83201 83213 83231 83236 83242 83249 83264 83286 83277 83276 83266 83264 83267 83256 83270 83268 83261 83268 83262
4115.0 83262 83255 83227 83231 83245 83232 83207 83196 83186 83181 83180 83172 83177 83175 83171 83162 83159 83179 83190 83189
4096.0H3189MJ3KJ2K4J8kPJ9MJ0JK3K5LlJ2K1L
4077.0H3385RPK3MKK1J2LRJ1rJJ9RNTj3J2J6
4058.0H3531KjmK2J3MPJ5J2mJ1J9j4k1PK9J3nO
4039.0H3642J7jm%LJ1j0j2RJ1ONjkj3NJ8M0L4
4020.0H3758KlJ3J9K6K1PJ3K3J7Kk1PK9J4TJ3on
4001.0H3943oK7K2NKl0j8K2Jj5TN%jJ8Mkj0T
3982.0H3942j3j1NK4J9l6l4j1LrJ2L0jj0MJ1J4OK5
3963.0H3970m9n9QL8L7J5LQj1k5L2N9n5q1l5m3N5J22P1
$$ plain form
4096.0 83189 83193 83206 83208 83220 83244 83262 83260 83267 83286 83290 83300 83301 83324 83349 83352 83349 83361 83382 83385
4077.0 83385 83394 83401 83424 83428 83430 83451 83463 83466 83475 83486 83477 83478 83497 83506 83511 83516 83503 83515 83531
4058.0 83531 83533 83532 83528 83550 83563 83567 83574 83589 83601 83597 83608 83627 83613 83592 83599 83628 83641 83636 83642
4039.0 83642 83659 83658 83654 83654 83657 83668 83658 83646 83655 83666 83672 83677 83676 83674 83661 83666 83684 83724 83758
4020.0 83758 83760 83757 83770 83789 83815 83836 83843 83856 83879 83896 83898 83877 83884 83913 83927 83941 83954 83948 83943
4001.0 83943 83937 83964 83986 83991 83993 83963 83945 83967 83968 83953 83938 83943 83943 83942 83960 83964 83962 83952 83942
3982.0 83942 83929 83918 83923 83947 83966 83930 83896 83885 83888 83879 83891 83921 83920 83910 83914 83925 83939 83945 83970
3963.0 83970 83921 83862 83870 83908 83945 83960 83963 83971 83960 83935 83967 84026 83971 83890 83855 83812 83867 83989 84060
3944.0H4060q1j97J6J11P5j5mL9L2L3l2j72r5K8L4O5R9R0p0
3925.0H4016j84l5J55J63n6o5J13q6j68O2J71J30N6J6LJ0M2O6k8
3906.0H4381j11k11j12o5PK18p0j61J46K45J54pL1j7l29j47K10K62K24
3887.0H4648r9m57p7J63K16P9l51j97K23K41J73M2l13k62J85K23j84n50M1
3868.0H3744M65K88k11l99J00J25m8J08K06J01j64l7J94k36o77l78K38M90K51
3849.0H4160J50J19Q3P5j33k06J00K8j87K9j18k37K80O2n8K68J11j95M
3830.0H4335K05J81m7k32j8J29J68N7m77n52J90N14L42k74m58J67L47J98N4
3811.0H4829J0Q1R0k75m13J43L20J41j60n96j91M55L67M5k24j5K08J59O7
$$ plain form
3944.0 84060 83979 83782 83798 83909 83984 83969 83965 84004 84036 84069 84037 83865 83770 83798 83832 83897 83996 84086 84016
3925.0 84016 83832 83797 83952 84115 84059 83994 84107 84021 83853 83915 84086 84216 84272 84288 84291 84301 84343 84409 84381
3906.0 84381 84270 84059 83947 83882 83889 84107 84037 83876 84022 84267 84421 84414 84445 84428 84099 83952 84162 84424 84648
3887.0 84648 84549 84092 84015 84178 84394 84473 84122 83925 84148 84389 84562 84604 84291 84029 84214 84437 84253 83703 83744
3868.0 83744 84209 84497 84286 83887 83987 84112 84064 84172 84378 84479 84315 84278 84472 84236 83559 83181 83419 83909 84160
3849.0 84160 84310 84429 84512 84587 84454 84248 84348 84376 84189 84218 84100 83863 84143 84205 84147 84415 84526 84331 84335
3830.0 84335 84540 84721 84674 84442 84424 84553 84721 84778 84301 83749 83939 84453 84795 84521 84063 84230 84577 84775 84829
3811.0 84829 84839 84920 85010 84735 84322 84465 84785 84926 84766 84170 83979 84434 84801 84846 84622 84607 84815 84974 85041
3792.0H5041K9j2j5PJ8J1r8j16M0J11J32j9k73p5J40J47O8L7J6
3773.0H5189L2M4k14l33J18K84j1k23NJ43J36J25j34l68J8J40n0N4J83
3754.0H5138Q9m17m19O0k57KM05M45Q1q41k24N12K01N1P4j8q4j96n27
3735.0H4075j69M23L9j14J91K63J77m1k17j32J42J51j78m1K37P4j5J12J44
3716.0H5121M6L8J2l99m17L2k6J20K49J30J9K0N6j32k80J6J44J08p
3697.0H4850p2n0l3L1%l17k42M7l69j62K90K04J9n7l6lj31k95q8
3678.0H3586R9j72q79m49N56N13k6n42m10m6L10K07L0n4o2m1m4r1q0
3659.0H2405J3o7l96k43J48J98O8k66n16l87m2j36P3M15K93O5p1m4K9
$$ plain form
3792.0 85041 85070 85058 85043 85050 85068 85079 84981 84865 84905 85016 85148 85129 84856 84781 84921 85068 85136 85173 85189
3773.0 85189 85221 85265 85051 84718 84836 85120 85109 84886 84891 85034 85170 85295 85161 84793 84811 84951 84901 84955 85138
3754.0 85138 85227 84810 84391 84451 84194 84196 84601 85046 85127 84286 84062 84574 84775 84826 84900 84882 84798 84602 84075
3735.0 84075 83906 84329 84368 84254 84445 84708 84885 84844 84627 84495 84637 84788 84610 84569 84806 84880 84865 84977 85121
3716.0 85121 85167 85205 85217 84818 84401 84433 84407 84527 84776 84906 84925 84945 85001 84869 84589 84605 84749 84857 84850
3697.0 84850 84778 84728 84695 84726 84726 84409 84167 84214 83845 83683 83973 84177 84196 84139 84103 84100 83969 83674 83586
3678.0 83586 83685 83513 82634 82185 82741 83254 83228 82686 82276 82230 82540 82747 82777 82723 82661 82620 82576 82485 82405
3659.0 82405 82418 82351 81955 81712 81860 82058 82126 81860 81344 80957 80915 80779 80852 81267 81560 81625 81554 81510 81539
3640.0H1539K5o1l3N9Tj37k08M0J74L1m71n89K52M20K39J09O7N9L7
3621.0H1611j04j99j27M3L05J33l0n9j25K05K40j13j41m6K4K21J92O4l1
3602.0H2063q9o1PK1Q7L7j08k4PN9J31J36J6k42k62j28K02K22P6
3583.0H2150M9L5m2m9Kpj4j2l3j2L1K5Pjj83l11l18L8K52
3564.0H1607J57J09N6n3l0N5K5J9K0Nn9j11n3O8P5J1p4n2n9
3545.0H1716m2M9P8O3Lk7J1L2q0TJ2L6ll7l8m9q3p8k2
3526.0H1461O5N7o2q0K7N2j0k8LmNK2k4n8m5o4j41l4O9
3507.0H1211M2Lk8n2o5j7L1L9L4k1p2n4kql6o8m3j2o5
$$ plain form
3640.0 81539 81564 81503 81470 81529 81588 81451 81243 81283 81457 81488 81017 80428 80680 81100 81339 81448 81515 81574 81611
3621.0 81611 81507 81308 81181 81224 81529 81662 81632 81573 81448 81653 81893 81780 81639 81593 81617 81838 82030 82094 82063
3602.0 82063 81974 81913 81920 81941 82028 82065 81957 81933 81940 81999 82130 82266 82282 82040 81778 81650 81852 82074 82150
3583.0 82150 82199 82234 82192 82143 82145 82138 82124 82112 82079 82067 82098 82123 82130 82129 81946 81635 81317 81355 81607
3564.0 81607 81764 81873 81929 81876 81846 81901 81926 81945 81965 81970 81911 81800 81747 81815 81890 81901 81827 81775 81716
3545.0 81716 81674 81723 81801 81864 81867 81840 81851 81883 81803 81723 81735 81771 81768 81731 81693 81644 81561 81483 81461
3526.0 81461 81526 81583 81521 81441 81468 81520 81510 81482 81485 81481 81486 81508 81484 81426 81381 81317 81176 81142 81211
3507.0 81211 81253 81256 81228 81176 81111 81094 81125 81164 81198 81177 81105 81051 81049 81041 81005 80937 80894 80882 80817
3488.0H0817m8nm4m5n2j20o4K3Rn9p9r2j00j02o0m0k6Kj2
3469.0G9903m5p1r5q1o2q8p1RN2Pl3j4K4M0N3N7P6P5R1
3450.0G9827J14R8K2N2J60J89J24P2J20J71J73J72J51J34J32R6P1P5J14
3431.0H2067J19R6R3N2N4Q9P8O1N2O5K7M3Q9R1P6N8P0TM4
3412.0H3394J5L7O2K6NM2M8L0N7O9M4L0M1Rj5K1N2N6K8
3393.0H4051NL0J0mRJ4KrJ1K6K0N0K8NJ6M2J3r%
3374.0H4310L5M4N3N7K9kJ2Jk9K0K4K9TJ7PJ8J4mQ
3355.0H4672K9M3M5L3Nk9j5J8J9KK7L1qoK1L4Oj8j5
$$ plain form
3488.0 80817 80769 80764 80720 80675 80623 80503 80439 80462 80471 80412 80333 80241 80141 80039 79979 79939 79913 79915 79903
3469.0 79903 79858 79787 79692 79611 79549 79461 79390 79399 79451 79458 79425 79411 79435 79475 79528 79585 79661 79736 79827
3450.0 79827 79941 80039 80061 80113 80273 80462 80586 80658 80778 80949 81122 81294 81445 81579 81711 81807 81878 81953 82067
3431.0 82067 82186 82282 82375 82427 82481 82570 82648 82709 82761 82826 82853 82896 82985 83076 83152 83210 83280 83350 83394
3412.0 83394 83409 83446 83508 83534 83539 83581 83629 83659 83716 83785 83829 83859 83900 83909 83894 83915 83967 84023 84051
3393.0 84051 84056 84086 84096 84092 84101 84115 84117 84108 84119 84145 84165 84215 84243 84248 84264 84306 84319 84310 84310
3374.0 84310 84345 84389 84442 84499 84528 84526 84538 84539 84510 84530 84554 84583 84612 84629 84636 84654 84668 84664 84672
3355.0 84672 84701 84744 84789 84822 84827 84798 84783 84801 84820 84822 84849 84880 84872 84866 84887 84921 84927 84909 84894
3336.0H4894k1rL3K3J1J6K4OJ1L0J0k8pPJ7LJ4K0K
3317.0H5056J3J8J0pj1L2M3Qk3ML7K3rk4k0k%J2T
3298.0H5172J0J1%LOj2j7qlpqOJ6Kj5rJ4Pj7
3279.0H5151RJjJj6nK4K5ok3nTjJ%j1jQp
3260.0H5139j2jj0K0J3l2k3NJ4KkK0K4ll7l6j6QO
3241.0H5079lj7ljJ1K0Tj9k8j3mk4knjj2%J6%
3222.0H5014j3qoj6POKk2j3nJ4mj7MJ9p%J1p
3203.0H4959j2jMjj1k6oJ2K9J3j6j3ONqTrj2%
$$ plain form
3336.0 84894 84873 84864 84897 84920 84931 84947 84971 84977 84988 85018 85028 85000 84993 85000 85017 85020 85034 85054 85056
3317.0 85056 85069 85087 85097 85090 85079 85111 85154 85162 85139 85143 85180 85203 85194 85170 85150 85148 85148 85160 85172
3298.0 85172 85182 85193 85193 85196 85202 85190 85173 85165 85162 85155 85147 85153 85169 85171 85156 85147 85161 85168 85151
3279.0 85151 85160 85161 85160 85161 85145 85140 85164 85189 85183 85160 85155 85150 85149 85150 85150 85139 85138 85146 85139
3260.0 85139 85127 85126 85116 85136 85149 85117 85094 85099 85113 85115 85113 85133 85157 85154 85117 85081 85065 85073 85079
3241.0 85079 85076 85059 85056 85055 85066 85086 85106 85087 85059 85046 85042 85018 85016 85011 85010 84998 84998 85014 85014
3222.0 85014 85001 84993 84987 84971 84978 84984 84986 84964 84951 84946 84960 84956 84939 84943 84962 84955 84955 84966 84959
3203.0 84959 84947 84946 84950 84949 84938 84912 84906 84918 84947 84960 84944 84931 84937 84942 84934 84926 84917 84905 84905
3184.0H4905mNkj4jk8l6J1J0j1T%mk4k8q%j5n
3165.0H4740pj0k8j4qk0k7j5qjj6j4k5Tk9l8k5k4l0
3146.0H4376k8k0k5l5j0rl0l5m6m1m2Tn4l7qln9n7n5
3127.0H3740o1n4m0n6q3n4m7r1r5q7j16j22j23Tj24j39j15r3j19
3108.0H1998j42j30j12j00r0j03q0p1q5j19j16j41j47j23j24j37j28j26j28
3089.0G9796q7n1l0L1P0O0P2J12J08N0M5M2K1m0o6q8j19j37j58
3070.0G9631j73j90k32k39k38k57k43j93Tj83j44j05r5p1j5K2N8J04J45
3051.0G7389J37J44J74K44K52K47J98K13K02J58J34J20J02R1J12R5O5M9K3
$$ plain form
3184.0 84905 84901 84906 84904 84890 84889 84861 84825 84836 84846 84835 84824 84824 84820 84796 84768 84760 84760 84745 84740
3165.0 84740 84733 84723 84695 84681 84673 84653 84626 84611 84603 84602 84586 84572 84547 84522 84493 84455 84430 84406 84376
3146.0 84376 84348 84328 84303 84268 84258 84249 84219 84184 84138 84097 84055 84013 83959 83922 83914 83911 83852 83795 83740
3127.0 83740 83679 83625 83585 83529 83446 83392 83345 83254 83159 83072 82956 82834 82711 82588 82464 82325 82210 82117 81998
3108.0 81998 81856 81726 81614 81514 81424 81321 81241 81170 81085 80966 80850 80709 80562 80439 80315 80178 80050 79924 79796
3089.0 79796 79709 79658 79628 79659 79729 79789 79861 79973 80081 80131 80176 80218 80239 80199 80133 80045 79926 79789 79631
3070.0 79631 79458 79268 79036 78797 78559 78302 78059 77866 77673 77490 77346 77241 77146 77075 77060 77082 77140 77244 77389
3051.0 77389 77526 77670 77844 78088 78340 78587 78785 78998 79200 79358 79492 79612 79714 79805 79917 80012 80077 80126 80149
3032.0H0149J5K0Lk0o9j08j44j64k15k65l05l36l95m56m92n43n84o21o77
3013.0G4793p21p28p53p80p87p92p94q11q25q42q56q81q94r09r47r69r91r95j009
2994.0E8509j002r91r59r38q70p75o59n21l38j15J13L45O02Q22J016J180J259J273J235
2975.0E9186J186J091R83Q65P68O82O20N77N80N81O05O12O07O29O56O30O13N79N32
2956.0G2582M66M13L21J84M8p2j86l33m80o37p28p75p77o79m91k61kK22L93
2937.0F9208N14N64N65N52N35N29N54N36N33N38N45N37M89M25L67K76J96J11J8
2918.0G7592j08k00l03l73m50n18n16m80m09k94j68LJ47K69L64M12M46M53M68
2899.0G6335M63M77TM47M08M02L83L53L26K85K47K08J62J19N3Mn2j14j69
$$ plain form
3032.0 80149 80164 80184 80187 80167 80098 79990 79846 79682 79467 79202 78897 78561 78166 77710 77218 76675 76091 75470 74793
3013.0 74793 74072 73344 72591 71811 71024 70232 69438 68627 67802 66960 66104 65223 64329 63420 62473 61504 60513 59518 58509
2994.0 58509 57507 56516 55557 54619 53749 52974 52315 51794 51456 51341 51454 51799 52401 53223 54239 55419 56678 57951 59186
2975.0 59186 60372 61463 62446 63311 64079 64761 65381 65958 66538 67119 67724 68336 68943 69572 70228 70858 71471 72050 72582
2956.0 72582 73048 73461 73782 73966 74014 73942 73756 73423 72943 72306 71578 70803 70026 69347 68856 68595 68593 68815 69208
2937.0 69208 69722 70286 70851 71403 71938 72467 73021 73557 74090 74628 75173 75710 76199 76624 76991 77267 77463 77574 77592
2918.0 77592 77484 77284 76981 76608 76158 75640 75124 74644 74235 73941 73773 73776 73923 74192 74556 74968 75414 75867 76335
2899.0 76335 76798 77275 77752 78199 78607 79009 79392 79745 80071 80356 80603 80811 80973 81092 81145 81149 81097 80983 80814
2880.0H0814k12k54k47k15j41k0Q4J92L12M02M53M78M55M26L66L07K63K27J82
2861.0H3872J83J45J29J05J00J07J29J40J33J35TJ36J05M6Mj3j4NO
2842.0H5588PJ9L0RnJ2K5mJ2J3pJ5J7jPkRJ1J
2823.0H5756QJ6J1PQnLJ3J4K7UN9M5L3M1L8M6M8
2804.0H6222M1M2N2TP0M7K5L8L1OK5N1L9L1M2Nj2j1%
2785.0H6796J7PK3PMj1qQK8J5j6nj9l6j6jk0k8k1
2766.0H6724j4k4l3k8j4Tk4rJ5J0nNJ3J4K8L8J7L3K0
2747.0H6752Mj5pJ8J7knQK0%k6j5JrNRjJ7J8
$$ plain form
2880.0 80814 80602 80348 80101 79886 79745 79725 79809 80001 80313 80715 81168 81646 82101 82527 82893 83200 83463 83690 83872
2861.0 83872 84055 84200 84329 84434 84534 84641 84770 84910 85043 85178 85313 85449 85554 85600 85604 85591 85577 85582 85588
2842.0 85588 85595 85614 85644 85653 85648 85660 85685 85681 85693 85706 85699 85714 85731 85730 85737 85735 85744 85755 85756
2823.0 85756 85764 85780 85791 85798 85806 85801 85804 85817 85831 85858 85885 85912 85971 86016 86049 86090 86128 86174 86222
2804.0 86222 86263 86305 86357 86409 86479 86526 86551 86589 86620 86626 86651 86702 86741 86772 86814 86819 86807 86796 86796
2785.0 86796 86813 86820 86843 86850 86854 86843 86835 86843 86871 86886 86870 86865 86846 86810 86794 86793 86773 86745 86724
2766.0 86724 86710 86686 86653 86625 86611 86597 86573 86564 86579 86589 86584 86589 86602 86616 86644 86682 86699 86732 86752
2747.0 86752 86756 86741 86734 86752 86769 86767 86762 86770 86790 86790 86764 86749 86750 86741 86746 86755 86754 86771 86789
2728.0H6789K2Mj9j3Jnl4k4LKNJ9OTK7L0J2J5K2
2709.0H6868K4QTnJj2j5k7lj3l2k2k%j3J2J7K7J7
2690.0H6838M0N4L6M4O6O9M3N1O5M6TM9L9L8N2M4L4K4L7
2671.0H7715K4J7K9L7K5K0%L3L0J8J4J1J8J1RJ4J9J5J
2652.0H8060L%K6OLK8K2j6MK6K5QJ3K1J1rjJ2j0
2633.0H8232mTjj9k0j7j4qk5m4l6l0j4k6l3l5l3m2m1
2614.0H7786m6m0Tl5m4l4k5rk0k1j0NJ1J4J2L5K0K1K3
2595.0H7603M0L0K3K9L8K9L3L7TK3K2K1K5K4K6K9K1J3N
$$ plain form
2728.0 86789 86811 86815 86796 86783 86784 86779 86745 86721 86724 86726 86731 86750 86756 86762 86789 86819 86831 86846 86868
2709.0 86868 86892 86900 86908 86903 86904 86892 86877 86850 86847 86834 86802 86780 86778 86778 86765 86777 86794 86821 86838
2690.0 86838 86878 86932 86968 87012 87078 87147 87190 87241 87306 87352 87398 87447 87486 87524 87576 87620 87654 87678 87715
2671.0 87715 87739 87756 87785 87822 87847 87867 87867 87900 87930 87948 87962 87973 87991 88002 88011 88025 88044 88059 88060
2652.0 88060 88063 88063 88089 88095 88098 88126 88148 88132 88136 88162 88187 88195 88208 88229 88240 88231 88230 88242 88232
2633.0 88232 88228 88224 88223 88204 88184 88167 88153 88145 88120 88076 88040 88010 87996 87970 87937 87902 87869 87827 87786
2614.0 87786 87740 87700 87660 87625 87581 87547 87522 87513 87493 87472 87462 87467 87478 87492 87504 87539 87559 87580 87603
2595.0 87603 87643 87673 87696 87725 87763 87792 87825 87862 87899 87922 87944 87965 87990 88014 88040 88069 88090 88103 88108
2576.0H8108J7K0K8QJ7L0J6PK3J1J3L1K8K9K8MK3M7L1
2557.0H8519L4M6K7L1L0M5L8K9L1K3J9L9K5K6PK6J2K8J6
2538.0H9051K1OJ0J9M3J2J0NJ4L0K4MLK2PLknm
2519.0H9273qjlmk6Tj1k0k2k6k4l5k9j7pk5k8l1j9
2500.0H8911k4j3roqoOJ8J7J9RJ8J7J2J3J5OJ8K
2481.0H9015J9PJ2jRJjj0rOJlNKJ3Lj1J0Q
2462.0H9076J4MPJ6K3MPQJ5UJ6LJ3PRJ7RJ0
2443.0H9288K1J6J3J6LQJ1LJ1LTJ1J5oPKjmO
$$ plain form
2576.0 88108 88125 88145 88173 88181 88198 88228 88244 88251 88274 88285 88298 88329 88357 88386 88414 88418 88441 88488 88519
2557.0 88519 88553 88599 88626 88657 88687 88732 88770 88799 88830 88853 88872 88911 88936 88962 88969 88995 89007 89035 89051
2538.0 89051 89072 89078 89088 89107 89150 89162 89172 89177 89191 89221 89245 89249 89252 89274 89281 89284 89282 89277 89273
2519.0 89273 89265 89264 89261 89257 89231 89205 89194 89174 89152 89126 89102 89067 89038 89021 89014 88989 88961 88930 88911
2500.0 88911 88887 88874 88865 88859 88851 88845 88851 88869 88886 88905 88914 88932 88949 88961 88974 88989 88995 89013 89015
2481.0 89015 89034 89041 89053 89052 89061 89062 89061 89051 89042 89048 89049 89046 89051 89053 89066 89069 89058 89068 89076
2462.0 89076 89090 89094 89101 89117 89140 89144 89151 89159 89174 89189 89204 89220 89223 89236 89243 89252 89269 89278 89288
2443.0 89288 89309 89325 89338 89354 89357 89365 89376 89379 89390 89393 89396 89407 89422 89416 89423 89425 89424 89420 89426
2424.0H9426RPqj3lo%MKj9k2noj2j7j4j2j4j6
2405.0H9281j4k0k1j6j1j3k1j3j8j7k5k0j9j2k3j3l0m7o7
2386.0H8861q1j08j48j91k23k61k89l02l07l03l32l45l82l81l94l64m46l73l55
2367.0H3276l11k89k65k36j57r3o1J8M5J91K60L38L39M53M42M44N41O84L16
2348.0H5935l57o25n03l23j54n2k2OJ16J20MkJ57J36K0j0j5Q5J11
2329.0H4627J91J54J96J23TQ1J41J23K45K52K84K27K24J76J05K9Q2J10J24
2310.0H7617J35J44J61J49J36J26J15Q2Q8O3R7P0R1P0P1P0O0Q3M7
2291.0H9475N2L8N8M6N0TL3J8jk3m0Tj8j7Tj8j4TJ0
$$ plain form
2424.0 89426 89435 89442 89434 89421 89418 89412 89412 89416 89418 89399 89377 89372 89366 89354 89337 89323 89311 89297 89281
2405.0 89281 89267 89247 89226 89210 89199 89186 89165 89152 89134 89117 89092 89072 89053 89041 89018 89005 88975 88928 88861
2386.0 88861 88780 88672 88524 88333 88110 87849 87560 87258 86951 86648 86316 85971 85589 85208 84814 84450 84004 83631 83276
2367.0 83276 82965 82676 82411 82175 82018 81925 81864 81882 81927 82118 82378 82716 83055 83508 83950 84394 84935 85619 85935
2348.0 85935 85578 84953 84450 84127 83973 83921 83899 83905 84021 84141 84145 84143 84300 84436 84456 84446 84431 84516 84627
2329.0 84627 84818 84972 85168 85291 85414 85495 85636 85759 86004 86256 86540 86767 86991 87167 87272 87301 87383 87493 87617
2310.0 87617 87752 87896 88057 88206 88342 88468 88583 88665 88753 88816 88913 88983 89074 89144 89215 89285 89345 89428 89475
2291.0 89475 89527 89565 89623 89669 89719 89769 89802 89820 89819 89796 89756 89716 89698 89681 89664 89646 89632 89618 89628
2272.0H9628mr%J2QJ1KkJ4QJ5JnoNJ3JoJ5
2253.0H9701KmRJ9QK4TJ2J7K9K7L4K0L6L7L6K9K8L7
2234.0I0125L3L1L3L0K2L1K5TL7K5J0K1L7L9K4K3L5N0K1
2215.0I0677L2K9L8L3K8K2L3M1L3K0K2K6K8J6J8J7PJ8P
2196.0I1145KPJ2J1Mj9mkNkJ3ljTkmOTo
2177.0I1167j7j0Toj9k5j2j4k4l0j3k4k2k3k6j4nj2j5
2158.0I0846KJ3PJ0RK4L6L7L5L6L8L9M5M8M4L7L5L4M0
2139.0I1415L5K0J1K6L2K4jJ2J0J6RJ7J4PJKQJ3Q
$$ plain form
2272.0 89628 89624 89615 89615 89627 89635 89646 89648 89646 89660 89668 89683 89684 89679 89673 89678 89691 89692 89686 89701
2253.0 89701 89703 89699 89708 89727 89735 89759 89783 89795 89812 89841 89868 89902 89922 89958 89995 90031 90060 90088 90125
2234.0 90125 90158 90189 90222 90252 90274 90305 90330 90355 90392 90417 90427 90448 90485 90524 90548 90571 90606 90656 90677
2215.0 90677 90709 90738 90776 90809 90837 90859 90892 90933 90966 90986 91008 91034 91062 91078 91096 91113 91120 91138 91145
2196.0 91145 91147 91154 91166 91177 91181 91162 91158 91156 91161 91159 91172 91169 91168 91167 91165 91161 91167 91173 91167
2177.0 91167 91150 91140 91130 91124 91105 91080 91068 91054 91030 91000 90987 90963 90941 90918 90892 90878 90873 90861 90846
2158.0 90846 90848 90861 90868 90878 90887 90911 90947 90984 91019 91055 91093 91132 91177 91225 91269 91306 91341 91375 91415
2139.0 91415 91450 91470 91481 91507 91539 91563 91562 91574 91584 91600 91609 91626 91640 91647 91648 91650 91658 91671 91679
2120.0I1679J7J6J7K5K7TM3N5M0K8L1M3L5K6K0J4J2K1J6
2101.0I2192mlPNlj5OJ8Lpk4LJ5mqP%kj2
2082.0I2174mj0j4j6pj3Tk0j1pk3j8j3k1k2l1m8l3L
2063.0I1853rl6k2k3l2l9l1k4k8j9k4l6j2k2k1k5k4k6k9
2044.0I1371j8k0m2lJ7J0PM%J6J4K0L0J4K7K2Kj3j
2025.0I1457j0k2l1j0j9l6m8m5j7O5L8M%Npoj2OJ8
2006.0I1330jNoJ3J2TkK8L3L8L7N1%r1PJ68P1l3K5
1987.0I1697N2J3mpk5Tk0k6m1l2n9m5n6n0m6o4o1m4r9
$$ plain form
2120.0 91679 91696 91712 91729 91754 91781 91808 91851 91906 91946 91974 92005 92048 92083 92109 92129 92143 92155 92176 92192
2101.0 92192 92188 92185 92192 92197 92194 92179 92185 92203 92206 92199 92175 92178 92193 92189 92181 92188 92188 92186 92174
2082.0 92174 92170 92160 92146 92130 92123 92110 92097 92077 92066 92059 92036 92018 92005 91984 91962 91931 91883 91850 91853
2063.0 91853 91844 91808 91786 91763 91731 91692 91661 91637 91609 91590 91566 91530 91518 91496 91475 91450 91426 91400 91371
2044.0 91371 91353 91333 91291 91288 91305 91315 91322 91326 91326 91342 91356 91376 91406 91420 91447 91469 91471 91458 91457
2025.0 91457 91447 91425 91394 91384 91365 91329 91281 91236 91219 91284 91322 91326 91326 91331 91324 91318 91306 91312 91330
2006.0 91330 91329 91334 91328 91341 91353 91365 91363 91391 91424 91462 91499 91550 91550 91459 91466 91634 91705 91672 91697
1987.0 91697 91749 91762 91758 91751 91726 91701 91681 91655 91614 91582 91523 91478 91422 91372 91326 91262 91201 91157 91058
1968.0I1058j54o3K7k8o8o4o5o4n2p1p9Tr0p5n0m1n5l9m2
1949.0H9906l7n6q7m4M2j09k03J15J64QMLNOK7J6K9L0K4
1930.0H9843L6M5O2Q4Q5N5m8O4K91K44J31q7N6L07J74Q6P4N6M0
1911.0I1598m3qP9M4N9L4qPJ7j7j0lmj7j8j25j4P0J8
1892.0I1659jj13k48J00J25k4o4m6k2j3m5l5n3k3j5l7l3l4m7
1873.0I1031m9o5j64l32j69Q2P5P1Jn2o2q4o5k8o2k4j6k4m4
1854.0I0020l3l0k2k0n1j59r4P0j05m24N2K88N4rl8p1j30pL1
1835.0H9322l2p6j3r4l82k44L34J91j08l04L5J57j0l0k7l8p9p5j6
$$ plain form
1968.0 91058 90904 90841 90868 90840 90772 90708 90643 90579 90527 90456 90377 90298 90208 90133 90083 90042 89987 89948 89906
1949.0 89906 89869 89813 89726 89682 89724 89615 89412 89527 89691 89699 89703 89706 89711 89717 89744 89760 89789 89819 89843
1930.0 89843 89879 89924 89986 90070 90155 90210 90162 90226 90517 90761 90892 90805 90861 91168 91342 91428 91502 91558 91598
1911.0 91598 91555 91547 91626 91670 91729 91763 91755 91762 91779 91762 91752 91749 91745 91728 91710 91585 91571 91641 91659
1892.0 91659 91658 91545 91297 91397 91522 91498 91434 91388 91366 91353 91308 91273 91220 91197 91182 91145 91112 91078 91031
1873.0 91031 90982 90917 90753 90421 90252 90334 90409 90480 90481 90429 90367 90283 90218 90190 90128 90104 90088 90064 90020
1854.0 90020 89987 89957 89935 89915 89864 89705 89611 89681 89576 89152 89204 89492 89546 89537 89499 89428 89298 89291 89322
1835.0 89322 89290 89214 89201 89107 88725 88481 88815 89006 88898 88594 88629 88786 88776 88746 88719 88681 88602 88527 88511
1816.0H8511po0r0j48j82j47P9q1j39p3r6j30k02l19j85k07k41m7j65
1797.0H6071m10k66j74n09o38k15j18k44l99m93n30o90n81n30o80r05q81p60q58
1778.0G6190j033j233j372j279j650k072j622j540j849k224k086k016k239k261k336k439k011j947k248
1759.0D0733k321k244j630j750k031j917k116j299j94j499p40l05n38p53r36r9L48r65r90
1740.0A8754J154L53n16o67j373Q1L628M72r51r5J720Q53P36J369J717J865K781L098K766
1721.0C7745K398J511K325N900K993J497K848K456J615J255J380J561J028N02R13J021Q89Q87K49
1702.0G0973n20K4K575N11n7r2J596J352N72N89N42N76O94P39P96M14k48l77J913
1683.0H2572J258L63J66N79N33K93l5j91P19N09m0p4J33j44L53N86K29J08M
$$ plain form
1816.0 88511 88504 88444 88354 88206 88024 87877 87956 87875 87736 87663 87567 87437 87235 86916 86731 86524 86283 86236 86071
1797.0 86071 85661 85395 85221 84712 84074 83859 83741 83497 83098 82605 82075 81385 80804 80274 79594 78689 77808 77048 76190
1778.0 76190 75157 73924 72552 71273 69623 67551 65929 64389 62540 60316 58230 56214 53975 51714 49378 46939 44928 42981 40733
1759.0 40733 38412 36168 34538 32788 30757 28840 26724 25425 25231 23732 22992 22687 22149 21396 20460 20361 20709 19744 18754
1740.0 18754 19908 20261 19745 19078 17705 17786 21414 21886 20935 20840 22560 23413 24149 25518 27235 29100 31881 34979 37745
1721.0 37745 40143 41654 43979 49879 52872 54369 57217 59673 61288 62543 63923 65484 66512 67014 67927 68948 69837 70724 70973
1702.0 70973 70453 70477 73052 73563 73506 73414 75010 76362 76934 77523 78065 78641 79335 80074 80870 81284 81036 80659 82572
1683.0 82572 83830 84193 84359 84938 85471 85764 85729 85538 86257 86766 86726 86652 86785 86641 86994 87580 87809 87917 87921
1664.0H7921k33p8L95K23M5j1n4o0k25o93j264Q08J038L48n6m37l66J2M13
1645.0H7726M39J3j49j02r8r1k09l33l07m74O36M28J4o0l0o9l04j26K33
1626.0H7137O6k89m35K97L02N9L2j8m04l03O83L46P6O6P2lj5J26O6
1607.0H7861J13J70L4k0Q4Q7P0R7Q8N3M7N9N2J48J21O6O5P0Q3
1588.0H9348O8M8M2K4K2J0NOK0j6k28p31J24N19Q7p3j09m48q23
1569.0H7895J96Q0l08p06p81n25p59j013j712l429l364k437j630k232l580k847j679j465p51
1550.0E8953R83J477J594J506K081K927J443J103J319K16L03J261K39m66q57j327j991j430j588
1531.0F7746j763j814j823j247p66J56R80N98J041K424M054K448R76J274K489J637J264Q14N74
$$ plain form
1664.0 87921 87688 87610 88005 88228 88273 88262 88208 88148 87923 87230 85966 86774 87812 88160 88104 87667 87301 87313 87726
1645.0 87726 88165 88178 88029 87927 87829 87738 87529 87196 86889 86415 87051 87479 87493 87433 87403 87334 87030 86904 87137
1626.0 87137 87203 86914 86479 86776 87078 87137 87169 87151 86747 86444 87127 87473 87549 87615 87687 87684 87669 87795 87861
1607.0 87861 87974 88144 88178 88158 88242 88329 88399 88496 88584 88637 88684 88743 88795 88943 89064 89130 89195 89265 89348
1588.0 89348 89416 89464 89506 89530 89552 89562 89567 89573 89593 89577 89349 88618 88742 89261 89348 89275 89166 88718 87895
1569.0 87895 88091 88171 87863 87157 86376 85851 85092 84079 82367 78938 75574 73137 71507 69275 65695 62848 61169 59704 58953
1550.0 58953 59936 61413 63007 64513 66594 69521 70964 72067 73386 73602 73905 75166 75405 74939 74082 72755 70764 69334 67746
1531.0 67746 65983 64169 62346 61099 60333 60489 61469 62067 63108 65532 69586 72034 73010 74284 76773 78410 79674 80488 81062
1512.0H1062Q22L83J97Q3k33N6J393Q47L56P2Q2J02j80j23J00l04O7K45o6
1493.0H4961j83m55p85k87j2n48m72m88q18j130j384j820j891j861j908j761j667q89o66
1474.0F5936q49l49L7l92p85Tm67k67J63J603J271P43N57J14m07o48o92l36l54
1455.0F4093o57r52j387j623j834k043k168j675j012n99P9P23J282J794K167K392J937J529L893
1436.0F5939K819J453J452J470J051P35R55P91M77L81J87j6K16L17ol31n27J03n3
1417.0G7413k84l26m92o71q54r80j130j362j610j897k177k702l069k959l322l448l343l263k589
1398.0D0935j925j693j050K73L78j47q6k65r78j742j948j796j782j328n49K53R10J477K049
1379.0C0986K520K766K288K092K308J987O72m25j117j717j946j892j710j391j238o64J57K31Q57
$$ plain form
1512.0 81062 81884 82267 82464 82547 82314 82370 83763 84610 84966 85038 85120 85222 85042 84919 85019 84715 84782 85027 84961
1493.0 84961 84778 84323 83538 83251 83239 82691 82219 81731 80913 79783 78399 76579 74688 72827 70919 69158 67491 66602 65936
1474.0 65936 65087 64738 64775 64383 63598 62813 62346 62079 62242 63845 65116 65859 66416 66530 66123 65475 64783 64447 64093
1455.0 64093 63436 62484 61097 59474 57640 55597 53429 51754 50742 50143 50222 50945 52227 54021 56188 58580 60517 62046 65939
1436.0 65939 68758 70211 71663 73133 74184 74919 75874 76665 77142 77523 77710 77694 77910 78227 78221 77890 77363 77466 77413
1417.0 77413 77129 76803 76311 75640 74786 73806 72676 71314 69704 67807 65630 62928 59859 56900 53578 50130 46787 43524 40935
1398.0 40935 39010 37317 36267 36540 36918 36771 36685 36420 35442 33700 31752 29956 28174 26846 26297 26550 27460 28937 30986
1379.0 30986 33506 36272 38560 40652 42960 44947 45619 45194 44077 42360 40414 38522 36812 35421 34183 33519 33676 33907 34764
1360.0C4764J360K201L249L686M039M344L930L382K973K455K092J715J356J080Q50O35M72K74Q
1341.0G4865j63o8r5k84m41n08o81q40q32p36n84m65m82o22p96j006j196j387j597
1322.0F2082j845k105k377k577k819l083l218l330l277l098k819k510k081j587j152q78o27m19l02
1303.0B1978j88q4JM2P5Q1J26J08Q9J17J44J40K39K80L88O49Q46J083J501
1284.0B7615J936K307K571K676K590K353K063J848J719J712J774J992K318K525K661K649K479K223J954
1265.0F9965J660J392J161R50Q31P40O19M97M10L55K91K12J59J18Q2O7N2M4L7
1246.0G9642L0K4N7N1L6pm2q5j29j99k86m02n18o25p16q35r59j052j115
1227.0G2870j170j202j236j304j404j557j771k045k360k673k890k943k759k359j792j183o31j95J12
$$ plain form
1360.0 34764 36124 38325 41574 45260 49299 53643 57573 60955 63928 66383 68475 70190 71546 72626 73476 74111 74583 74857 74865
1341.0 74865 74702 74634 74539 74255 73814 73306 72625 71785 70953 70217 69633 69168 68686 68064 67268 66262 65066 63679 62082
1322.0 62082 60237 58132 55755 53178 50359 47276 44058 40728 37451 34353 31534 29024 26943 25356 24204 23326 22699 22280 21978
1303.0 21978 21790 21706 21707 21749 21824 21905 22031 22139 22228 22345 22489 22629 22868 23148 23536 24185 25031 26114 27615
1284.0 27615 29551 31858 34429 37105 39695 42048 44111 45959 47678 49390 51164 53156 55474 57999 60660 63309 65788 68011 69965
1265.0 69965 71625 73017 74178 75128 75959 76699 77318 77815 78225 78580 78871 79083 79242 79360 79442 79509 79561 79605 79642
1246.0 79642 79672 79696 79753 79804 79840 79833 79791 79706 79577 79378 79092 78690 78172 77547 76831 75996 75037 73985 72870
1227.0 72870 71700 70498 69262 67958 66554 64997 63226 61181 58821 56148 53258 50315 47556 45197 43405 42222 41591 41396 41508
1208.0D1508K82L16K54J59L6r3k26l28m08m35m55m96o33q65j197j555j818j963j940
1189.0C0143j758j464j142q32n82l70j88rJ29K79M26N96P53R16J076J143J105J004P97
1170.0C2022N01K02p4l22n17o81q37r31r86r98r82r03p99p15o25n14m08l31k43
1151.0B1859j60o3N7J81L32M88O81R17J179J481J807K126K393K620K745K800K753K656K489
1132.0D9341K320K100J882J636J366J100Q58N98L79J56m3k42m33n78o55n90l79mM00
1113.0E9212P85J119J270J245J092Q50N88K65o7m06p36j058j291j401j334j074o76j58L49
1094.0E8574P47R57R59Q05N55K29j33m73p95j186j645k195k808l511m255m913n313n145m283
1075.0B6171l087k003j274q53n75l12k1K86O14R68J285J453J500J630J995K670L552M211M399
$$ plain form
1208.0 41508 41790 42106 42360 42519 42555 42462 42236 41908 41500 41065 40610 40114 39481 38616 37419 35864 34046 32083 30143
1189.0 30143 28385 26921 25779 24947 24365 23995 23807 23798 23927 24206 24632 25228 25981 26897 27973 29116 30221 31225 32022
1170.0 32022 32523 32725 32651 32329 31812 31131 30294 29363 28377 27379 26397 25494 24695 23980 23355 22841 22433 22102 21859
1151.0 21859 21699 21636 21693 21874 22206 22694 23375 24292 25471 26952 28759 30885 33278 35898 38643 41443 44196 46852 49341
1132.0 49341 51661 53761 55643 57279 58645 59745 60603 61201 61580 61736 61693 61451 61018 60440 59785 59195 58816 58812 59212
1113.0 59212 59997 61116 62386 63631 64723 65573 66161 66426 66359 65953 65217 64159 62868 61467 60133 59059 58383 58225 58574
1094.0 58574 59321 60278 61237 62042 62597 62826 62693 62220 61425 60239 58594 56399 53591 50080 45825 40912 35599 30454 26171
1075.0 26171 23084 21081 19807 18954 18379 18067 18046 18332 18946 19914 21199 22652 24152 25782 27777 30447 33999 38210 42609
1056.0D2609M017L466L025K809K724K689K672K504K232J949J712J481J221J005Q24O81N05L37J95
1037.0G8657R6l4k18l40n04p09r33j188j513j823k148k417k499k380k147j939j829j768j673
1018.0E2691j445j144q25m57j23J41L88O31Q39J082J341J610J893K173K382K490K518K456K320
999.0G0961K155J909J703J520J311J098R83Q54P15O10N60M68M02L34K79K53K43J91J61
980.0H6710J54J44J37J40J51J35J39J84TJ75J93J80J89J78J77J68J56J21J25
961.0H9740J16R5R4J08P8Q0M8Q9J11R5P5O9P9M9M5N0L0L1M8
942.0I1130L4J4J9J3KOj1j3prk7l8l9o8n7k4j5m1k5
923.0I0844m9l7l2m1o0m4r0m9n3n1m5m0q8o9n0p2q2r9j24
$$ plain form
1056.0 42609 46626 50092 53117 55926 58650 61339 64011 66515 68747 70696 72408 73889 75110 76115 76939 77620 78125 78462 78657
1037.0 78657 78753 78719 78501 78161 77657 76948 76015 74827 73314 71491 69343 66926 64427 62047 59900 57961 56132 54364 52691
1018.0 52691 51246 50102 49277 48820 48697 48838 49226 49857 50696 51778 53119 54729 56622 58795 61177 63667 66185 68641 70961
999.0 70961 73116 75025 76728 78248 79559 80657 81640 82494 83209 83819 84379 84847 85249 85583 85862 86115 86358 86549 86710
980.0 86710 86864 87008 87145 87285 87436 87571 87710 87894 88078 88253 88446 88626 88815 88993 89170 89338 89494 89615 89740
961.0 89740 89856 89951 90045 90153 90231 90311 90359 90448 90559 90654 90729 90798 90877 90926 90971 91021 91051 91082 91130
942.0 91130 91164 91178 91197 91210 91212 91218 91207 91194 91187 91178 91151 91113 91074 91006 90949 90925 90910 90869 90844
923.0 90844 90795 90758 90726 90685 90625 90581 90491 90442 90389 90338 90293 90253 90165 90096 90046 89974 89892 89793 89669
904.0H9669j51j74k09k34k75l28l82m48n37o44p72r63j194j388j663j972k205k307k266
885.0G1557k146j868j499j143q98p76p49q56r68j064j134j166j096q76o18l65j00J90L50
866.0E4775L21J15k30o72j007j136j009o58n5O99J526K306K952L406L610L530L272K892K449
847.0G7086K058J685J393J120R21P98O57N42M37L58L21K61K21J76J30P2P4P1K4
828.0H8405j2k4n9j09j43j40k10k57l06l22l67m74n33o66p89r39j177j503j862
809.0G8513k293k554k513j958r98M7P73J077R95Q12O51N79O81R11J048J044R71R11Q65
790.0G9562P86P45O83N97M39L64K30J47K4p0k72m27n04n44o70p50q48q70r05
771.0G7717q25o10k27R3J92J21m2k34m33n16n68o39m09j41n6q0k4R8J35
$$ plain form
904.0 89669 89518 89344 89135 88901 88626 88298 87916 87468 86931 86287 85515 84552 83358 81970 80307 78335 76130 73823 71557
885.0 71557 69411 67543 66044 64901 64003 63227 62478 61622 60654 59590 58456 57290 56194 55318 54700 54335 54235 54425 54775
866.0 54775 55096 55211 54981 54309 53302 52166 51157 50499 50444 51143 52669 54975 57927 61333 64943 68473 71745 74637 77086
847.0 77086 79144 80829 82222 83342 84263 85061 85718 86260 86697 87055 87376 87637 87858 88034 88164 88236 88310 88381 88405
828.0 88405 88393 88369 88310 88201 88058 87918 87708 87451 87145 86823 86456 85982 85449 84783 83994 83055 81878 80375 78513
809.0 78513 76220 73666 71153 69195 68197 68244 69017 70094 71089 71901 72552 73131 73812 74723 75771 76815 77786 78697 79562
790.0 79562 80348 81093 81776 82373 82812 83176 83406 83553 83577 83507 83235 82808 82304 81760 81090 80340 79492 78622 77717
771.0 77717 76892 76282 76055 76148 76340 76461 76419 76185 75752 75236 74668 74029 73620 73479 73423 73343 73319 73417 73552
752.0G3552R9O9J30K04K08K21K52K24K46K51K33K28K34K43K40K26K08K31K91
733.0G7590L05L67M28M45N41O06O52Q22P80Q52R34Q27P13P17O97N65L27K21R3
714.0H8482J35L84K48O0N9L7N6N4j9J3K76j2r7k1k19r0K12Q9J64
695.0H9811J19j38j48J22j54n1J66l4l1Mj65o8J38O5k4q7k3M5O5
676.0H9612J6N8O2K7j1m45j651j971L023J201K12k5p6J3J64q5j76o5o4
657.0H9819j0L1KJo6p3k5l0k8J7n8j56k33k80n52r21j257j394j046
638.0H3741j28Q66J466J465J068O71M79L28K09J42J00M1K4J04L1L0M4Nm5
619.0I0641j30j4J73R4L1J8J1K0pJ0nlK2LoK1rK3j0
$$ plain form
752.0 73552 73651 73720 73850 74054 74262 74483 74735 74959 75205 75456 75689 75917 76151 76394 76634 76860 77068 77299 77590
733.0 77590 77895 78262 78690 79135 79676 80282 80934 81756 82536 83388 84322 85149 85862 86579 87276 87841 88168 88389 88482
714.0 88482 88617 89001 89249 89309 89368 89405 89461 89515 89496 89509 89785 89773 89676 89655 89436 89346 89558 89647 89811
695.0 89811 89930 89792 89644 89766 89612 89561 89727 89693 89662 89666 89501 89433 89571 89636 89612 89525 89502 89547 89612
676.0 89612 89628 89686 89748 89775 89764 89319 87668 85697 88720 89921 90133 90108 90032 90045 90209 90124 89948 89883 89819
657.0 89819 89809 89840 89842 89843 89777 89704 89679 89649 89621 89638 89580 89424 89191 88911 88359 87438 86181 84787 83741
638.0 83741 83613 84479 85945 87410 88478 89149 89628 89956 90165 90307 90407 90448 90472 90576 90607 90637 90681 90686 90641
619.0 90641 90511 90497 90670 90764 90795 90813 90824 90844 90837 90847 90842 90839 90861 90864 90858 90879 90870 90893 90883
600.0I0883l8lN3j0k1m6m9j11%k1p8Tj50j85k02l26l81m30n25
581.0H8282n38m41l49k75j33P9P8P5P1Q0J79Q7O5R8J05J21Q6K9J01
562.0H7800J52J18J23R6O8J26R0J05J16Q0Q7l7Q1J50R4J38K27J32R6
543.0H9842J70J57L0Q3J15P4J25J32j4Q2J54K1j2O9M0j07q8K04K18
524.0I1295N2QJ4TJ21O2j14J49K04R4M3k7o4J0m0p1r4j5L1
505.0I1672o0j71k32p1j49l21k91l83l89m53p07p03p19q52q95r48j024j073j053
486.0H1178j116j285j210j054j128r97o27k22K50O11P38O99L23M14N74L78K36L79L99
467.0G8540L32K28R7o9l10o08q42j178j784k090j294j256j054n11K02M42M68
$$ plain form
600.0 90883 90845 90842 90895 90885 90864 90818 90769 90658 90658 90637 90559 90481 90331 90146 89944 89618 89237 88807 88282
581.0 88282 87744 87303 86954 86679 86546 86625 86703 86778 86849 86929 87108 87195 87260 87358 87463 87584 87670 87699 87800
562.0 87800 87952 88070 88193 88289 88357 88483 88573 88678 88794 88874 88961 88924 89005 89155 89249 89387 89614 89746 89842
543.0 89842 90012 90169 90199 90282 90397 90471 90596 90728 90714 90796 90950 90971 90959 91028 91068 90961 90873 91077 91295
524.0 91295 91347 91355 91369 91383 91504 91566 91452 91601 91805 91899 91942 91915 91851 91861 91821 91750 91656 91641 91672
505.0 91672 91612 91441 91209 91138 90989 90668 90377 89994 89605 89152 88445 87742 87023 86171 85276 84328 83304 82231 81178
486.0 81178 80062 78777 77567 76513 75385 74388 73761 73539 73789 74400 75138 75837 76160 76574 77148 77526 77762 78141 78540
467.0 78540 78872 79100 79197 79128 78818 78210 77368 76190 74406 72316 71022 69766 68712 68201 68403 68845 69313
##END= 
